20100811FailedDebugBuild

From Daya Bay

Jump to: navigation, search

djaffe's notes on failed build on 20100811 of debug trunk on RACF

./dybinst -r trunk projects dybgaudi

    • gets this
../src/ByteBuffer.cc:104: error: ‘memcpy’ was not declared in this scope
make[3]: *** [../x86_64-slc5-gcc43-dbg/ByteBuffer.o] Error 1
make[2]: *** [DaqReadoutFormat] Error 2
added
 #include <cstring> 
. try again
    • got farther, do same for these
/afs/rhic.bnl.gov/dayabay/software/trunk/dbg/NuWa-trunk/dybgaudi/DaqFormat/FileReadoutFormat/src/FileReader.cc
/afs/rhic.bnl.gov/dayabay/software/trunk/dbg/NuWa-trunk/dybgaudi/DaqFormat/FileReadoutFormat/src/MetadataStrings.cc
/afs/rhic.bnl.gov/dayabay/software/trunk/dbg/NuWa-trunk/dybgaudi/DaqFormat/FileReadoutFormat/src/FileNameStrings.cc
/afs/rhic.bnl.gov/dayabay/software/trunk/dbg/NuWa-trunk/dybgaudi/DaqFormat/LtbReadoutFormat/src/LtbFrame.cc
    • got past DaqFormat, now get
In file included from ../src/RawDataConSvc.cc:12:
../src/RawEventHeaderCnv.h:45: warning: type qualifiers ignored on function return type
../src/RawEventHeaderCnv.h:82: error: extra qualification ‘RawEventHeaderCnv::’ on member ‘unpackEvent’
make[3]: *** [../x86_64-slc5-gcc43-dbg/RawDataConSvc.o] Error 1
make[2]: *** [RawDataIO] Error 2
Personal tools